id,title,subtitle,volumeTitle,author,translator,compiler,media,pageCount,binding,genre,category,isbn,sequence,edition,publisher,publishingYear,chiefEditor,editor,publisherEditor,artistEditor,technicalEditor,artist,illustrator,createdBy,completedBy,createdAt,updatedAt
16390,Неприятности,,,"Кели Фейвър",Silverkata,,цифров,,,"Еротичен любовен роман; Любовен роман; Съвременен любовен роман","·········· Любовни романи и повести",,,първо,Читанка,2021,,Epsilon,,,,,,Silverkata,,2021-12-27T20:00:30+02:00,2022-01-23T13:02:33+02:00
10120,Неподчинение,,,"Кели Фейвър",Silverkata,,цифров,,,"Съвременен любовен роман; Еротичен любовен роман; Любовен роман","·········· Любовни романи и повести",,,първо,Читанка,2018,,"sladcheto; desi7y",,,,,,Silverkata,,2019-06-08T00:06:43+03:00,2019-12-03T09:38:43+02:00
10119,Обвързани,,,"Кели Фейвър",Silverkata,,цифров,,,"Съвременен любовен роман; Еротичен любовен роман; Любовен роман","·········· Любовни романи и повести",,,първо,Читанка,2018,,"galileo414; desi7y",,,,,,Silverkata,,2019-06-08T00:03:06+03:00,2019-12-04T21:02:09+02:00
10118,Открити,,,"Кели Фейвър",Silverkata,,цифров,,,"Съвременен любовен роман; Еротичен любовен роман; Любовен роман","·········· Любовни романи и повести",,,първо,Читанка,2018,,desi7y,,,,,,Silverkata,,2019-06-07T23:58:40+03:00,2019-12-03T09:37:46+02:00
10133,"Да имаш за съсед порода",,,"Лора Лей",Illusion,,цифров,,,"Романтично фентъзи; Еротичен любовен роман; Любовен роман","···················· Фентъзи",,,първо,Читанка,2013,,,,,,,,Silverkata,,2019-06-08T01:24:56+03:00,2019-06-08T01:29:55+03:00
10255,"Кървави книги",,"том 5","Клайв Баркър","Иван Атанасов",,хартия,224,мека,,"···················· Хорър",978-619-02-0134-2,,първо,"ИК „Колибри“",2017,,,,,"Симеон Айтов","Росен Дуков",,Еми,,2019-06-15T12:35:38+03:00,2019-06-15T13:20:40+03:00
10182,"Нейният пехотинец",,,"Хедър Лонг",Ralna,,цифров,,,"Съвременен любовен роман; Еротичен любовен роман; Любовен роман","·········· Любовни романи и повести",,,първо,Читанка,2016,,ganinka,,,,,,Silverkata,,2019-06-09T15:22:12+03:00,2019-10-30T11:58:48+02:00
8424,Заплаха,,,"Кели Фейвър",denensita,,цифров,,,"Съвременен любовен роман; Еротичен любовен роман","·········· Любовни романи и повести",,,първо,Читанка,2016,,"galileo414, ganinka",,,,,,Silverkata,,2019-01-03T20:25:10+02:00,2019-06-07T23:57:28+03:00
10012,"Девицата каубой",,,"Алекса Райли",Ralna,,цифров,,,"Съвременен любовен роман","·········· Любовни романи и повести",,,първо,Читанка,2018,,"galileo414; desi7y",,,,,,Silverkata,,2019-06-03T14:30:42+03:00,2019-10-27T20:50:56+02:00
3209,"Четири точки",,,"Лили Сейнт Джърмейн",denensita,,цифров,,,"Трилър; Криминална литература; Любовно-криминален роман; Еротичен любовен роман","·········· Криминална проза",,,първо,Читанка,2017,,ganinka,,,,,,vesi_libra,,2017-09-27T14:17:10+03:00,2019-06-08T00:47:16+03:00
8422,Лъжи,,,"Кели Фейвър",denensita,,цифров,,,"Съвременен любовен роман; Еротичен любовен роман","·········· Любовни романи и повести",,,първо,Читанка,2015,,ganinka,,,,,,Silverkata,,2019-01-03T20:19:29+02:00,2019-06-07T23:56:24+03:00
2460,"Светът на а`кото",,,"Тери Пратчет","Катя Анчева",,хартия,122,мека,"Хумористично и пародийно фентъзи; Детска и юношеска литература","·········· Детска литература",978-954-422-105-8,"Истории от света на диска",първо,"„Архонт-В“ ООД",2015,,"Весела Петрова",,,,,"Питър Денис",WizardBGR,,2017-07-06T07:18:07+03:00,2021-11-12T18:58:40+02:00
16725,"Опетнена корона",,,"Ерин Уот","Галя Евтимова",,хартия,208,мека,"Любовен роман; Съвременен любовен роман","·········· Любовни романи и повести",978-954-27-2708-8,,"първо (не е указано)","Уо; „Егмонт България“ ЕАД",2022,,"Вили Вълканова",,,,,,Silverkata,,2022-02-26T17:40:26+02:00,2022-02-26T17:50:24+02:00
13768,"Приказка за две сестри",,,"Джулия Куин",Ави,,цифров,,,"Любовен роман; Исторически любовен роман","·········· Любовни романи и повести",,,първо,Читанка,2014,,,,,,,,Silverkata,,2020-10-03T11:11:30+03:00,2020-10-03T11:17:28+03:00
6675,"Двор от скреж и звездна светлина",,,"Сара Дж. Маас","Цветелина Тенекеджиева",,хартия,288,твърда,,"···················· Фентъзи",978-954-27-2206-9,,"първо (не е указано)","„Егмонт България“ ЕАД",2018,,"Радка Бояджиева",,,,"Map — Kelly de Groot",,Silverkata,,2018-07-25T14:56:15+03:00,2022-05-23T14:59:08+03:00
10142,"Подаръкът на порочния милиардер",,,"Мегън Марч",Ralna,,цифров,,,"Любовен роман; Съвременен любовен роман; Еротичен любовен роман","·········· Любовни романи и повести",,,първо,Читанка,2018,,"galileo414; desi7y; sladcheto",,,,,,Silverkata,,2019-06-08T02:33:38+03:00,2020-07-30T21:01:00+03:00
10256,"Кървави книги",,"том 3","Клайв Баркър","Иван Атанасов",,хартия,260,мека,,"···················· Хорър",978-619-150-253-0,,първо,"ИК „Колибри“",2013,,"Мила Томанова",,,,"Стефан Касъров",,Еми,,2019-06-15T13:10:07+03:00,2019-06-15T14:43:55+03:00
10011,"Да намериш девица",,,"Алекса Райли",Ralna,,цифров,,,"Съвременен любовен роман","·········· Любовни романи и повести",,,първо,Читанка,2016,,ganinka,,,,,,Silverkata,,2019-06-03T14:23:58+03:00,2019-10-27T20:50:22+02:00
10020,"Похотливата лейди",,,"Джилиан Итън",denensita,,цифров,,,"Исторически любовен роман","·········· Любовни романи и повести",,,първо,Читанка,2018,,"galileo414; desi7y",,,,,,Silverkata,,2019-06-03T16:36:31+03:00,2019-12-03T09:36:35+02:00
10051,"Графът и неговата девствена графиня",,,"Доминик Ийстуик",Ralna,,цифров,,,"Исторически любовен роман","·········· Любовни романи и повести",,,първо,Читанка,2016,,ganinka,,,,,,Silverkata,,2019-06-04T16:18:22+03:00,2019-12-03T09:37:23+02:00
9338,"Обвързани с грях",,,"Синтия Идън","bonbon4e; Illusion",,цифров,,,"Любовен роман; Съвременен любовен роман; Романтично фентъзи; Градско фентъзи; Еротичен любовен роман; Кратък любовен роман","·········· Любовни романи и повести",,,първо,Читанка,2019,,,,,,,,in82qh,,2019-04-04T09:50:03+03:00,2021-03-20T06:27:17+02:00
10127,"Пет мили",,,"Лили Сейнт Джърмейн",denensita,,цифров,,,"Любовно-криминален роман; Еротичен любовен роман","·········· Криминална проза",,,първо,Читанка,2015,,ganinka,,,,,,Silverkata,,2019-06-08T00:37:39+03:00,2019-06-08T00:40:44+03:00
10174,"Оправдани лъжи",,"Част трета","Уитни Грасия Уилямс",Lux,,цифров,,,"Съвременен любовен роман; Еротичен любовен роман; Любовен роман","·········· Любовни романи и повести",,,първо,Читанка,2016,,"galileo414; ganinka",,,,,,Silverkata,,2019-06-09T13:54:46+03:00,2019-08-13T00:40:43+03:00
10181,"Кажи го на пехотинеца",,,"Хедър Лонг",Ralna,,цифров,,,"Съвременен любовен роман; Еротичен любовен роман; Любовен роман","·········· Любовни романи и повести",,,първо,Читанка,2015,,ganinka,,,,,,Silverkata,,2019-06-09T15:08:46+03:00,2019-08-13T00:38:49+03:00
8420,Истина,,,"Кели Фейвър",denensita,,цифров,,,"Съвременен любовен роман; Еротичен любовен роман","·········· Любовни романи и повести",,,първо,Читанка,2015,,ganinka,,,,,,Silverkata,,2019-01-03T20:14:40+02:00,2019-06-07T23:55:18+03:00
10160,Изкушен,,,"Ребека Занети",Ralna,,цифров,,,"Романтично фентъзи; Еротичен любовен роман; Любовен роман","···················· Фентъзи",,,първо,Читанка,2016,,ganinka,,,,,,Silverkata,,2019-06-09T08:22:39+03:00,2019-10-31T18:49:30+02:00
10257,"Кървави книги",,"том 2","Клайв Баркър","Иван Атанасов",,хартия,224,мека,,"···················· Хорър",978-619-150-069-7,,първо,"ИК „Колибри“",2013,,"Невена Дишлиева-Кръстева",,,,"Стефан Касъров",,Еми,,2019-06-15T13:50:08+03:00,2021-10-29T09:18:51+03:00
10010,"Да уловиш девица",,,"Алекса Райли",Ralna,,цифров,,,"Съвременен любовен роман","·········· Любовни романи и повести",,,първо,Читанка,2016,,ganinka,,,,,,Silverkata,,2019-06-03T14:17:58+03:00,2019-10-27T20:49:49+02:00
10019,"Червенокоса красавица",,,"Джилиан Итън",denensita,,цифров,,,"Исторически любовен роман","·········· Любовни романи и повести",,,първо,Читанка,2015,,"desi7y; ganinka",,,,,,Silverkata,,2019-06-03T16:29:56+03:00,2019-06-03T16:32:25+03:00
10050,"Маркизът и неговата любовница",,,"Доминик Ийстуик",Ralna,,цифров,,,"Исторически любовен роман; Любовен роман","·········· Любовни романи и повести",,,първо,Читанка,2016,,ganinka,,,,,,Silverkata,,2019-06-04T16:09:56+03:00,2019-12-03T09:37:02+02:00
8531,"Обвързани с мрак",,,"Синтия Идън",Illusion,,цифров,,,"Вампири и върколаци; Любовен роман; Романтично фентъзи; Фентъзи","·········· Любовни романи и повести",,,първо,Читанка,2018,,,,,,,,in82qh,,2019-01-13T12:17:16+02:00,2021-03-20T06:29:27+02:00
10126,"Шестима братя",,,"Лили Сейнт Джърмейн",denensita,,цифров,,,"Любовно-криминален роман; Еротичен любовен роман","·········· Криминална проза",,,първо,Читанка,2015,,ganinka,,,,,,Silverkata,,2019-06-08T00:33:30+03:00,2019-06-08T00:41:57+03:00
10173,"Оправдани лъжи",,"Част втора","Уитни Грасия Уилямс",Lux,,цифров,,,"Съвременен любовен роман; Еротичен любовен роман; Любовен роман","·········· Любовни романи и повести",,,първо,Читанка,2015,,"Ralna; ganinka",,,,,,Silverkata,,2019-06-09T13:49:29+03:00,2019-08-13T00:40:28+03:00
8419,Последствия,,,"Кели Фейвър",denensita,,цифров,,,"Съвременен любовен роман; Еротичен любовен роман","·········· Любовни романи и повести",,,първо,Читанка,2015,,ganinka,,,,,,Silverkata,,2019-01-03T20:10:22+02:00,2019-06-07T23:54:04+03:00
10139,"Целувка за Коледа",,,"Лора Лей",Alena,,цифров,,,"Романтично фентъзи; Еротичен любовен роман; Любовен роман","···················· Фентъзи",,,първо,Читанка,2015,,"Ralna; desi7y; ganinka",,,,,,Silverkata,,2019-06-08T02:05:59+03:00,2019-06-08T02:08:51+03:00
12292,"Антракт в смъртта",,,"Нора Робъртс",Fantastique,,цифров,,,"Любовен роман; Любовно-криминален роман; Дамски криминален роман","·········· Криминална проза",,,първо,Читанка,2012,,,,,,,,Silverkata,,2020-05-01T10:07:31+03:00,2020-11-10T18:22:37+02:00
1944,"Стефани Плъм или г-ца Сватовница",,,"Джанет Еванович",Illusion,,цифров,,,"Любовен роман; Чиклит","·········· Любовни романи и повести",,,,Читанка,2017,,,,,,,,in82qh,,2017-05-22T14:12:47+03:00,2019-02-19T11:26:01+02:00
10138,"Сделката на Барак",,,"Лора Лей",Ralna,,цифров,,,"Романтично фентъзи; Еротичен любовен роман; Любовен роман","···················· Фентъзи",,,първо,Читанка,2015,,ganinka,,,,,,Silverkata,,2019-06-08T01:59:30+03:00,2019-06-08T02:03:42+03:00
10021,"Коледа в Хоукс Уей",,,"Джоан Джонстън",ganinka,,цифров,,,"Съвременен любовен роман","·········· Любовни романи и повести",,,първо,Читанка,2015,,denensita,,,,,,Silverkata,,2019-06-03T16:43:27+03:00,2019-06-03T16:49:33+03:00
10137,"Улф и Хоуп",,,"Лора Лей",Alena,,цифров,,,"Романтично фентъзи; Еротичен любовен роман; Любовен роман","···················· Фентъзи",,,първо,Читанка,2016,,"Ralna; desi7y; ganinka",,,,,,Silverkata,,2019-06-08T01:49:11+03:00,2019-11-12T06:51:09+02:00
16581,Риск,,,"Кели Фейвър",Silverkata,,цифров,,,"Еротичен любовен роман; Любовен роман; Съвременен любовен роман","·········· Любовни романи и повести",,,първо,Читанка,2022,,sqnka,,,,,,Silverkata,,2022-01-26T12:01:40+02:00,2022-07-09T12:25:54+03:00
11565,"Алфа алтернативата Баронс",,,"Карън Мари Монинг",Silverkata,,цифров,,,"Романтично фентъзи; Любовен роман; Фентъзи; Градско фентъзи; Еротичен любовен роман","···················· Фентъзи",,,първо,Читанка,2020,,sqnka,,,,,,Silverkata,,2020-01-01T19:03:14+02:00,2020-04-30T19:21:23+03:00
10170,"Любов: НЕцивилизован",,,"Сойър Бенет",Ralna,,цифров,,,"Съвременен любовен роман; Еротичен любовен роман; Любовен роман","·········· Любовни романи и повести",,,първо,Читанка,2016,,ganinka,,,,,,Silverkata,,2019-06-09T13:27:56+03:00,2019-09-02T21:17:40+03:00
7953,"Защото съгреших",,,"Даринда Джоунс",SilverkaTa,,цифров,,,,"···················· Фентъзи",,"Моята библиотека",първо,Читанка,2018,,,,,,"analda; SiverkaTa",,Еми,,2018-11-22T19:24:35+02:00,2018-12-01T14:15:09+02:00
10258,"Кървави книги",,"том 1","Клайв Баркър","Иван Атанасов",,хартия,248,мека,,"···················· Хорър",978-954-529-952-0,,първо,"ИК „Колибри“",2012,,"Невена Дишлиева-Кръстева",,,,"Стефан Касъров",,Еми,,2019-06-15T14:31:49+03:00,2019-06-15T14:42:21+03:00
10006,"Неговата принцеса",,,"Алекса Райли",Ralna,,цифров,,,"Кратък любовен роман","·········· Любовни романи и повести",,,първо,Читанка,2017,,"galileo414; desi7y; sladcheto",,,,,,Silverkata,,2019-06-03T13:40:04+03:00,2019-10-27T20:47:56+02:00
10008,"Да бележиш девица",,,"Алекса Райли",Ralna,,цифров,,,"Съвременен любовен роман","·········· Любовни романи и повести",,,първо,Читанка,2016,,ganinka,,,,,,Silverkata,,2019-06-03T14:08:32+03:00,2019-10-27T20:49:15+02:00
10018,"Мрачна красота",,,"Джилиан Итън",denensita,,цифров,,,"Исторически любовен роман","·········· Любовни романи и повести",,,първо,Читанка,2015,,ganinka,,,,,,Silverkata,,2019-06-03T16:18:58+03:00,2019-06-03T16:28:39+03:00
10049,"Херцогът и девицата",,,"Доминик Ийстуик",Ralna,,цифров,,,"Исторически любовен роман","·········· Любовни романи и повести",,,първо,Читанка,2015,,"desi7y; ganinka",,,,,,Silverkata,,2019-06-04T15:50:59+03:00,2019-06-04T16:07:44+03:00
3656,"Пингвини в паника",,,"Джийн Уилис","Катя Перчинкова",,хартия,192,мека,"Романи и повести за деца","·········· Детска литература",978-619-164-160-4,"Children’s books",първо,"Ентусиаст; Enthusiast",2015,,"Велислава Вълканова",,,,"Ед Виър","Нейтън Рийд",vesi_libra,,2017-11-14T10:11:05+02:00,2017-11-14T10:11:05+02:00
10122,"Перфектната половинка",,,"Лий-Анн Уолъс",Ralna,,цифров,,,"Еротичен любовен роман; Романтично фентъзи; Любовен роман","···················· Фентъзи",,,първо,Читанка,2016,,"galileo414; desi7y; ganinka",,,,,,Silverkata,,2019-06-08T00:16:57+03:00,2019-12-02T09:19:32+02:00
10125,"Седем Синове",,,"Лили Сейнт Джърмейн",denensita,,цифров,,,"Любовно-криминален роман; Еротичен любовен роман","·········· Криминална проза",,,първо,Читанка,2015,,"Ralna; ganinka",,,,,,Silverkata,,2019-06-08T00:26:14+03:00,2019-06-08T08:00:58+03:00
13205,Гърдата,,,"Филип Рот","Божидар Стойков",,хартия,92,мека,,"···················· Съвременни романи и повести",978-954-529-844-8,,първо,"ИК „Колибри“",2011,,"Кристин Димитрова",,,,,,Еми,,2020-07-24T18:29:58+03:00,2022-02-04T19:13:51+02:00
1942,"Обвързани с кръв",,,"Синтия Идън",Illusion,,цифров,,,"Вампири и върколаци; Градско фентъзи; Любовен роман","·········· Любовни романи и повести",,,,Читанка,2017,,,,,,,,in82qh,,2017-05-22T14:06:01+03:00,2019-02-19T11:22:57+02:00
10140,"Подаръкът на Шейха",,,"Маргарит Кей",ganinka,,цифров,,,"Исторически любовен роман; Любовен роман","·········· Любовни романи и повести",,,първо,Читанка,2015,,denensita,,,,,,Silverkata,,2019-06-08T02:10:19+03:00,2019-06-08T02:15:08+03:00
10141,"Пленена от принца на вълците",,,"Маргарит Кей",ganinka,,цифров,,,"Исторически любовен роман; Любовен роман; Романтично фентъзи","·········· Любовни романи и повести",,,първо,Читанка,2016,,Ralna,,,,,,Silverkata,,2019-06-08T02:15:56+03:00,2019-11-12T06:51:56+02:00
10172,"Оправдани лъжи",,"Част първа","Уитни Грасия Уилямс",Lux,,цифров,,,"Съвременен любовен роман; Еротичен любовен роман; Любовен роман","·········· Любовни романи и повести",,,първо,Читанка,2015,,"Ralna; desi7y; ganinka",,,,,,Silverkata,,2019-06-09T13:41:38+03:00,2019-08-13T00:40:15+03:00
10190,Бунтовникът,,,"Джулиан Маклийн",denensita,,цифров,,,"Исторически любовен роман; Любовен роман","·········· Любовни романи и повести",,,първо,Читанка,2015,,ganinka,,,,,,Silverkata,,2019-06-09T16:48:52+03:00,2019-08-13T00:37:11+03:00
8418,Дисциплина,,,"Кели Фейвър",denensita,,цифров,,,"Съвременен любовен роман; Еротичен любовен роман","·········· Любовни романи и повести",,,първо,Читанка,2015,,"desi7y, ganinka",,,,,,Silverkata,,2019-01-03T19:59:43+02:00,2019-06-07T23:52:18+03:00
10007,"Девицата булка",,,"Алекса Райли",Ralna,,цифров,,,"Съвременен любовен роман","·········· Любовни романи и повести",,,първо,Читанка,2017,,"galileo414; desi7y; sladcheto",,,,,,Silverkata,,2019-06-03T13:51:22+03:00,2019-10-27T20:48:36+02:00
10124,"Коледен подарък",,,"Лий-Анн Уолъс",Ralna,,цифров,,,"Еротичен любовен роман; Романтично фентъзи; Любовен роман","···················· Фентъзи",,,първо,Читанка,2016,,ganinka,,,,,,Silverkata,,2019-06-08T00:21:28+03:00,2019-12-02T09:18:57+02:00
10183,"Един сезон в Лондон",,,"Кристин Уайдън",Ralna,,цифров,,,"Исторически любовен роман; Любовен роман","·········· Любовни романи и повести",,,първо,Читанка,2016,,Еми,,,,,,Silverkata,,2019-06-09T15:32:30+03:00,2019-12-03T09:39:47+02:00
10187,"Един секси планинец",,,"Сюзън Еноч",Ralna,,цифров,,,"Исторически любовен роман; Любовен роман","·········· Любовни романи и повести",,,първо,Читанка,2015,,ganinka,,,,,,Silverkata,,2019-06-09T16:26:15+03:00,2019-08-13T00:37:32+03:00
10150,"Ангелски танц",,,"Налини Синг",Сирена,,цифров,,,"Романтично фентъзи; Любовен роман","···················· Фентъзи",,,,Читанка,2018,,"galileo414; desi7y",,,,,,Silverkata,,2019-06-08T09:29:53+03:00,2019-11-12T06:52:42+02:00
12293,"С кръв и чест",,,"Крис Метцен","Катина Цонева",,цифров,,,"Героическо фентъзи (Меч и магия); Дарк фентъзи; Епическо фентъзи","···················· Фентъзи",,WarCraft,първо,Читанка,2016,,,,,,"Бил Петрас; Крис Метцен",,debora,,2020-05-01T11:05:25+03:00,2022-10-01T11:01:03+03:00
16648,"Стефан Цвайг",,,"Антонина Валентен","Генчо П. Цвятков; Николай Дончев",,хартия,128,твърда,"Мемоари; Публицистична статия; Съвременна проза (XX век)","·········· Сборници с разнообразно съдържание",,"Библиотека „Златни зърна“",,"Славчо Атанасов",1948,,"Славчо Атанасов",,,,,,Karel,mitashki_mitko,2022-02-08T23:03:18+02:00,2022-02-08T23:23:28+02:00
5901,"Избрани творби в три тома","Разкази; Горе във вилата","том 3","Съмърсет Моъм","Жаклина Хаимова; Иглика Василева; Цветан Попов; Цветан Стоянов; Александър Хрусанов","Димитри Иванов",хартия,680,"твърда с обложка","Съвременна проза (XX век)","···················· Съвременна проза: разкази и новели",,,"първо; трето","ДИ „Народна култура“",1988,,"Димитрина Кондева; Иглика Василева",,"Стефан Десподов","Олга Стоянова","Николай Пекарев",,Karel,,2018-05-25T12:37:32+03:00,2019-08-07T09:59:29+03:00
20240,"Цар Футбол",,,"Антон Антонов — Тонич",,,хартия,160,мека,,"·········· Хумор и сатира",,,,"Държавно издателство „Медицина и физкултура“",1964,,"Дечко Миланов",,"Димко Димчев","Боян Славов",,"Борис Димовски",Еми,,2024-04-05T13:24:33+03:00,2024-04-05T13:37:39+03:00
15891,"Играчът на шах",,,"Стефан Цвайг","Румяна Христова",,хартия,67,меки,"Съвременна проза","···················· Съвременна проза: разкази и новели",,,,"Книгоиздателство „Бисер“","1945  (не е указана)",,,,,,,,Karel,,2021-09-20T01:24:39+03:00,2022-06-28T09:29:30+03:00
8990,"Раковски — ученикъ",,,"Петъръ Карапетровъ",,,хартия,12,,"Съвременна проза (XX век)","···················· Българска историческа проза",,"Исторически разкази",,"Книгоиздателство и печатница „Древна България“","1936 (не е указана)",,,,,,,,Karel,,2019-02-24T21:38:53+02:00,2019-02-24T23:13:45+02:00
12064,"Космически комедии",,,"Итало Калвино","Божан Христов",,хартия,132,"мека с обложка","Научна фантастика; Притча; Философска фантастика","···················· Научна фантастика",,"Преводна литература",първо,"Христо Г. Данов",1976,,"Светозар Златаров",,"Веселин Христов","Найден Русинов","Христо Брайков",,debora,,2020-03-14T11:41:11+02:00,2020-03-15T01:52:45+02:00
4900,"Шахматна новела",,,"Стефан Цвайг","Венцеслав Константинов",,хартия,64,мека,"Съвременна проза (XX век)","···················· Съвременна проза: разкази и новели",,Стадион,първо,"Държавно издателство „Медицина и физкултура“",1973,,"Сийка Рачева",,"М. Табакова","М. Белова",,,Karel,,2018-03-09T01:29:07+02:00,2022-05-05T12:51:21+03:00
12588,"Къщата с призраците",,,"Уошингтън Ървинг","Мария Райчева; Диди Бурилкова; Правда Митева",,хартия,232,мека,,"···················· Класическа проза: разкази и новели",,"Избрани книги за деца и юноши",,"Издателство „Отечество“",1983,,,,,,"Светлана Йосифова",,Еми,Silverkata,2020-05-28T20:35:14+03:00,2022-02-16T19:29:20+02:00
11821,"Произведено в провинцията",,,"Георги Мишев",,,хартия,180,мека,"Кратки прозаични жанрове; Хумористична проза","···················· Съвременна българска проза: разкази и новели",,,първо,"Христо Г. Данов",1980,,"Добромир Тонев",,"Веселин Христов","Любен Петров","Борис Димовски",,debora,,2020-02-12T22:39:06+02:00,2020-02-12T22:55:26+02:00
6703,Опасно!,"Криминална фантастика",,,"Красномир Крачунов; Иво Христов","Николай Странски; Иво Христов; Иван Минков",хартия,160,мека,"Фантастика; Криминална фантастика; Хумористична и пародийна фантастика","···················· Научна фантастика",,"SF Трилър","първо (не е указано)","ИГ „Неохрон“ — Универс","1992 (не е указана)",,,,,,,,debora,,2018-07-27T18:53:09+03:00,2022-07-27T20:34:12+03:00
6704,"Контактът невъзможен","Сблъсък с чуждия разум",,,"Красномир Крачунов","Иво Христов; Николай Странски",хартия,160,мека,"Фантастика; Научна фантастика","···················· Научна фантастика",,"SF Трилър",,"ИГ „Неохрон“ („Универс“); ИК „Хермес“","1992 (не е указана)",,,,,,,,debora,,2018-07-27T19:17:47+03:00,2020-03-04T23:47:04+02:00
13360,"Да го направим",,,"Лайза Клейпас","Гергана Драйчева",,хартия,112,мека,"Любовен роман; Исторически любовен роман","·········· Любовни романи и повести",978-954-399-264-5,"Колекция „Любов и страст“",първо,"СББ Медиа АД",2018,,"Златина Пенева",,,,,,Silverkata,,2020-08-13T22:01:18+03:00,2020-08-13T22:17:37+03:00
15408,"Алената цитадела",,,"Робърт Хауърд",,,хартия,64,мека,"Героическо фентъзи (Меч и магия)","···················· Фентъзи",954-409-052-5,"Поредица за деца и юноши „Екскалибур“","първо (не е указано)","Издателска къща „Плеяда“",1991,,"Юлия Кирова",,"Стефан Кръстанов",,"Петър Станимиров","Евгений Йорданов",debora,,2021-07-04T20:54:30+03:00,2021-07-04T21:37:17+03:00
14385,Професия,"Научнофантастична новела",,"Айзек Азимов","Кузо Петров",,хартия,31,меки,"Научна фантастика","···················· Научна фантастика",,"Библиотека „Космос“",,"Държавно военно издателство",1969,,"Светослав Славчев",,,,,,Karel,,2021-01-02T22:01:04+02:00,2021-01-03T12:50:11+02:00
15154,Стоик,,,"Джон Голзуърди","Мария Неделева",,хартия,112,мека,,"···················· Класическа проза: разкази и новели",954-8009-04-8,,"първо (не е указано)","Издателство „Гарант-21“",1991,,"Кръстан Дянков",,,"Дарина Асенова","Вихра Янчева",,Еми,vesi_libra,2021-05-10T11:52:19+03:00,2021-05-27T07:33:23+03:00
13113,"Сянка отвъд времето","Разкази и новели",,"Х. Ф. Лъвкрафт","Огняна Иванова","Иван Атанасов",хартия,208,мека,,"···················· Хорър","619-01-0618-8; 978-619-01-0618-0","Библиотека „Магика“",първо,Изток-Запад,2020,,,,,,,,debora,,2020-07-13T22:36:01+03:00,2020-07-13T23:09:25+03:00
17212,"Кървавият изумруд",,,"Едгар Уолес","Н. Е. Бюлев",,хартия,136,мека,,"·········· Криминална проза",,,"второ (не е указано)","Книгоиздателска къща "" AVES""",1992,,"Таня Георгиева",,,"Юлиана Хорозова","Александър Стефанов",,Еми,,2022-06-20T10:15:41+03:00,2022-06-20T10:22:31+03:00
10559,"Други богове","Неиздавани разкази и новели",,"Х. Ф. Лъвкрафт","Огняна Иванова","Иван Атанасов",хартия,288,мека,"Мистично фентъзи; Фантастика; Свръхестествено; Хорър (литература на ужаса)","···················· Хорър","619-01-0483-5; 978-619-01-0483-4","Библиотека „Магика“",първо,Изток-Запад,2019,,,,,,,,debora,,2019-07-22T21:45:39+03:00,2021-02-20T16:38:12+02:00
12101,"Корнел Ещи",,,"Дежьо Костолани","Стефка Хрусанова",,хартия,384,мека,,"···················· Съвременна проза: разкази и новели",954-642-158-8,,,"Pensoft; Пенсофт",2002,,"Индра Николова-Маркова",,,,,,debora,,2020-03-20T23:46:09+02:00,2020-03-21T21:46:47+02:00
5191,"Изкривени реалности",,,"Коста Сивов",,,хартия,128,мека,Трилър,"···················· Българска фантастика",978-619-169-095-4,,първо,"Монт ООД",2015,,,,,,,,cattiva2511,,2018-04-01T15:18:44+03:00,2018-04-01T15:31:13+03:00
17224,"Кораби — убийци","Американска военна фантастика",,,,,хартия,128,мека,,"···················· Научна фантастика",,"SF Трилър","първо (не е указано)","ИГ „Неохрон“ — „Универс“","1992 (не е указана)",,,,,,,,debora,,2022-06-22T19:20:40+03:00,2022-09-05T21:40:00+03:00