id,title,subtitle,volumeTitle,author,translator,compiler,media,pageCount,binding,genre,category,isbn,sequence,edition,publisher,publishingYear,chiefEditor,editor,publisherEditor,artistEditor,technicalEditor,artist,illustrator,createdBy,completedBy,createdAt,updatedAt
17790,"Заключената планета",,,"Васил Райков; Георги Данаилов",,,хартия,100,"твърда с обложка","Детска и юношеска литература; Космическа фантастика; Научна фантастика; Приключенска фантастика","···················· Българска фантастика",,"Библиотека „Приключения и научна фантастика“","първо (не е указано)","„Народна младеж“ — издателство на ЦК на ДКМС",1965,,"Светозар Златаров",,"Иван Стоилов","Лазар Христов","Иван Кирков",,debora,,2022-10-16T21:55:34+03:00,2022-12-26T13:33:32+02:00
7235,"Произход на живота",,,"Джон Бернал","Г. Десев; Д. Грънчарова; В. Диков; М. Костова; Г. Марков",,хартия,348,"твърда с обложка","Научнопопулярна литература; Биология","·········· Научнопопулярна литература",,,първо,"Издателство на Българската академия на науките",1971,,"М. Ленкова",,,"Д. Костова","Данаил Донков",,vesi_libra,,2018-09-20T11:15:07+03:00,2021-11-27T18:16:33+02:00
3939,"Горящата долина",,,"Филип Боноски","Вера Стоименова",,хартия,364,твърда,,"···················· Класически романи и повести",,"Младежка библиотека „Меридиани“",първо,"„Народна младеж“ — издателство на ЦК на ДКМС",1973,,"Богдана Зидарова",,"Тодор Варджиев","Маргарита Воденичарова","Веселин Павлов",,vesi_libra,,2017-12-07T17:40:32+02:00,2021-05-05T12:46:06+03:00
15054,Цушима,,,"А. Новиков-Прибой","Орлин Василев",,хартия,696,"твърда с обложка",,"···················· Военна проза",,"Библиотека „50 години съветски роман“","трето (грешно указано второ)","Държавно военно издателство",1967,,"Евстати Бурнаски",,"Гичо Гичев","Тодор Попов","Петър Кръстев",,Еми,,2021-04-19T06:24:24+03:00,2021-04-19T06:36:26+03:00
12145,"Съчинения в два тома",Проза,"том втори","Атанас Далчев",,,хартия,360,"твърда с обложка",,"·········· Българска литература",,,първо,"Български писател",1984,,"Михаил Неделчев",,"Олга Паскалева","Емилия Нейчева","Развигор Колев",,Еми,,2020-03-25T17:34:18+02:00,2020-03-25T17:40:54+02:00
5977,"Събрани съчинения","Женско сърце. Ако можеха да говорят","том трети","Йордан Йовков",,,хартия,364,"твърда с обложка",,"·········· Българска литература",,"Събрани съчинения в шест тома",,"Български писател",1970,"Симеон Султанов","Светла Гюрова",,"Магда Абазова","Цветана Арнаудова","Владислав Паскалев",,Еми,,2018-05-31T12:46:02+03:00,2020-03-23T15:57:21+02:00
4377,"Събрани съчинения",Лирика,"том 1","Иван Вазов",,,хартия,424,Твърда,,"·········· Българска литература",,"Събрани съчинения в двадесет и два тома",,"„Български писател“",1974,"Георги Цанев","Славка Иванова",,,"Любен Петров","Евгени Клинчаров",,Еми,,2018-01-11T09:44:24+02:00,2019-08-02T15:25:56+03:00
4466,"Събрани съчинения",,"том 2","Христо Ботев",,,хартия,504,твърда,,"·········· Българска литература",,"Събрани съчинения в три тома",,"Български писател",1979,"Стефана Таринска","Светла Гюрова",,"Стефан Груев","Виолета Кръстева","Евгени Клинчаров",,Еми,,2018-01-19T16:23:44+02:00,2019-08-02T15:23:15+03:00
48,"Сред животните на Африка",,,"Бернхард Гжимек","Розалия Вълчанова; Николай Йовчев",,хартия,304,мека,"Творби за животни (анималистична проза); Документални очерци","·········· Научнопопулярна литература",,,първо,"Държавно издателство „Земиздат“",1976,,"Анастасия Цанкова",,"Михаил Макариев","Веселин Младжов","Веселин Павлов",,vog,,2015-05-12T22:52:45+03:00,2018-03-01T18:08:50+02:00
3946,"Повест с двойно дъно",,,"Вера Мутафчиева",,,хартия,92,мека,,,,"Героика и приключения",,"Държавно военно издателство",1974,,"Христо Минчев",,"Гичо Гичев","Цветанка Николова","Асен Старейшински",,gogo_mir,,2017-12-08T15:03:38+02:00,2018-01-01T09:23:09+02:00
2975,"Брилянтите на Кухтерин",,,"Михаил Черньонок","Иванка Караманчева",,хартия,328,мека,,"·········· Криминална проза",,"Библиотека „Лъч“",първо,"Народна младеж",1984,,"Светлана Тодорова",,"Стойчо Желев","Гинка Иванова","Роберто Андреев",,gogo_mir,,2017-09-06T11:17:32+03:00,2017-09-06T11:17:32+03:00
