id,title,subtitle,volumeTitle,author,translator,compiler,media,pageCount,binding,genre,category,isbn,sequence,edition,publisher,publishingYear,chiefEditor,editor,publisherEditor,artistEditor,technicalEditor,artist,illustrator,createdBy,completedBy,createdAt,updatedAt
19212,"Ключова дума лъжа",,,"Рудолф Щайнер","Александър Димов",,цифров,,,"Екзистенциална философия; Интелектуална проза; Съвременна философия (XX-XXI в.)","···················· Философия",,,първо,Читанка,2023,,,,,,,,zelenkroki,,2023-08-25T17:18:24+03:00,2024-01-29T20:29:00+02:00
12313,"В гората на Къркпатрик",,,"Дара Джой",Fantastique,,цифров,,,"Любовен роман","·········· Любовни романи и повести",,,първо,Читанка,2012,,,,,,,,Silverkata,,2020-05-06T09:44:54+03:00,2020-05-06T09:49:22+03:00
12314,"Безценно момиче",,,"Даяна Палмър",Fantastique,,цифров,,,"Любовен роман","·········· Любовни романи и повести",,,първо,Читанка,2013,,,,,,,,Silverkata,,2020-05-06T09:57:17+03:00,2020-05-06T09:59:29+03:00
14622,"Празник на красотата",,,"Хелън Скот Тейлър",Illusion,,цифров,,,"Любовен роман","·········· Любовни романи и повести",,,първо,Читанка,2021,,,,,,,,in82qh,,2021-02-15T10:10:07+02:00,2021-03-31T08:56:51+03:00
3872,"Реквием за Дявола",,,"Джери Смит-Реди",Fantastique,,цифров,,,"Градско фентъзи; Любовен роман; Романтично фентъзи","···················· Фентъзи",,,,Читанка,2012,,,,,,,,in82qh,,2017-12-03T16:10:25+02:00,2019-02-19T11:24:27+02:00
10028,Наградата,,,"Джули Гарууд",Ralna,,цифров,,,"Исторически любовен роман","·········· Любовни романи и повести",,,първо,Читанка,2015,,"galileo414; desi7y; ganinka",,,,,,Silverkata,,2019-06-03T17:39:53+03:00,2019-06-03T17:43:12+03:00
10029,"Непокорни желания",,,"Джули Гарууд",Ralna,,цифров,,,"Исторически любовен роман","·········· Любовни романи и повести",,,първо,Читанка,2011,,,,,,,,Silverkata,,2019-06-03T17:44:10+03:00,2019-06-03T17:47:38+03:00
10030,"Чест и Величие",,,"Джули Гарууд",Ralna,,цифров,,,"Исторически любовен роман","·········· Любовни романи и повести",,,първо,Читанка,2011,,,,,,,,Silverkata,,2019-06-03T17:48:56+03:00,2019-06-04T15:48:49+03:00
14383,"Писмо до краля",,,"Тонке Драгт","Победа Глухарова",,цифров,,,"Историческо фентъзи; Приключенска литература; Рицарски приключенски роман","·········· Приключенска литература",,,,Читанка,2021,,,,,,,,analda,,2021-01-02T19:06:52+02:00,2021-03-20T06:35:27+02:00
14642,"Обещание за Свети Валентин",,,"Сюзън Белами","Illusion; viyan",,цифров,,,,"·········· Любовни романи и повести",,,първо,Читанка,2021,,,,,,,,in82qh,,2021-02-24T04:14:13+02:00,2021-05-04T10:41:03+03:00
4920,"Фантастични животни и къде да ги намерим",,,"Нют Скамандър","Марион дьо Реамюр - Мария; Ринроуз Хъбъл - Мария; Джесика Адамс - Соня; проф. Лиу Янг - Бени; Джордж Фелтърн - Тишо; Блеър Уолдорф - Маги; Кай Бренуин - Мъро",,цифров,,,"Детско и младежко фентъзи: Детска литература","···················· Фентъзи",,,,Читанка,,,"Лешник Боримечков - Спас; проф. Лиу Янг - Бени",,,,,,vesi_libra,,2018-03-11T19:16:27+02:00,2018-04-12T08:58:46+03:00
15168,"Злокобен танц",,,"Стивън Кинг","Деница Минчева",,цифров,,,"Културология; Мемоари; Научнопопулярна литература; Фантастика; Хорър (литература на ужаса)","···················· Литературознание",,,първо,Читанка,2015,,,,,,,,cattiva2511,,2021-05-12T14:35:58+03:00,2021-05-12T14:59:13+03:00
3142,"Принцът-ренегат или Братът на краля",,,"Джордж Р. Р. Мартин","Хексе; Бумър; Deziderata; Somniator; Elenore; Викта-Тутка-Рачка",,цифров,,,"Епическо фентъзи","···················· Фентъзи",,,,Читанка,2017,,,,,,,,vesi_libra,,2017-09-21T14:40:10+03:00,2018-05-26T17:46:40+03:00
3150,"Принцесата и Кралицата или Черните и Зелените",,,"Джордж Р. Р. Мартин","Бумър; Хексе; g-style; Windy; Deziderata; Magrat",,цифров,,,"Епическо фентъзи","···················· Фентъзи",,,,Читанка,2017,,,,,,,,vesi_libra,,2017-09-22T10:42:12+03:00,2018-05-26T17:45:52+03:00
17742,"Избрани разкази",,,"Алекс Кош","Пламен Панайотов","Пламен Панайотов",цифров,,,,"···················· Фентъзи",,"Моята библиотека",първо,Читанка,2022,,,,,,,,Silverkata,,2022-10-05T11:08:07+03:00,2022-12-20T19:53:36+02:00
7505,"Златните ябълки на Слънцето",,,"Рей Бредбъри","Деница Минчева; Ива Тодорова; Н. К. Перфилова",,цифров,,,,"···················· Научна фантастика",,,първо,Читанка,2018,,,,,,,,moosehead,,2018-10-14T14:58:41+03:00,2020-01-17T18:34:54+02:00
3677,"Нашият малък атинянски братовчед",,,"Джулия Дароу Коулс","Десислава Паскалева",,цифров,,,"Историческа проза; Исторически роман","·········· Исторически романи и повести",,,"първо (не е указано)",Читанка,2016,,,,,,"John Goss",,"Desislava Paskaleva",,2017-11-15T20:38:16+02:00,2021-05-02T09:24:13+03:00
5981,"Нощта на дракона",,,"Ричард А. Кнаак","Катина Цонева",,цифров,,,"Героическо фентъзи (Меч и магия); Дарк фентъзи; Епическо фентъзи; Фентъзи","···················· Фентъзи",,"Моята библиотека",,Читанка,2018,,,,,,,,Еми,,2018-05-31T14:06:03+03:00,2018-06-07T13:58:10+03:00
3682,"Микрокосмически истории","100 удивителни научнофантастични разказа",,"Айзък Азимов (съставител)","Деница Минчева","Айзък Азимов; Мартин Х. Грийнберг; Джоузеф Д. Оландер",цифров,,,"Научна фантастика; Фентъзи; Разказ с (не)очакван край","···················· Научна фантастика",,,,Читанка,2017,,,,,,,,moosehead,,2017-11-16T13:10:08+02:00,2018-10-14T15:40:36+03:00
9088,Е,"Роман за лъжците, обяда и изчезналите бикини",,"Мат Бомонт","Светлана Ахчийска",,цифров,,,"Епистоларен роман; Сатиричен роман; Съвременен роман (XX в.)","···················· Съвременни романи и повести",,,"първо (не е указано)",Читанка,2020,,,,,,,,Еми,,2019-03-09T14:58:35+02:00,2021-03-20T06:22:55+02:00
18561,"Прекрасният ден",,,"Е. С. Тъб",КатеринаК,,цифров,,,"Научна фантастика","···················· Научна фантастика",,,,Читанка,2023,,,,,,,,moosehead,,2023-04-06T11:27:00+03:00,2023-04-07T05:47:20+03:00
7555,Преданост,,,"Тимъти Зан","Неандерталеца Джо",,цифров,,,,"·········· Фантастика",,,,Читанка,2018,,,,,,analda,,Еми,,2018-10-18T14:15:04+03:00,2019-01-25T07:10:55+02:00
1943,"Рицар за Коледа",,,"Донна Хатч",Illusion,,цифров,,,"Любовен роман","·········· Любовни романи и повести",,,,Читанка,2017,,,,,,,,in82qh,,2017-05-22T14:09:19+03:00,2019-02-19T11:24:44+02:00
11430,"Големите стъпки","Ново джобно издание",,"Хамънд Инис","Атанаска Топуркова; Ати Кисимова; Веско Сеферов; Диана Аврамова; Димитрийка Думкова; Иван Тонев; Йоана Янкова; Лидия Дремалова; Любомира Борисова; Любомир Мирчев; Мария Джамбазова; Мария Ланджева; Михаил Александров; Райна Петрова; Теодора Лазарова; Фани Кюлюмова",,цифров,,,"Съвременна проза (XX век)","···················· Съвременни романи и повести",,,първо,Читанка,2019,,Silverkata,,,,analda,,Silverkata,,2019-12-08T09:39:22+02:00,2019-12-10T11:29:18+02:00
8361,"Булка за Коледа",,,"Натали-Никол Бейтс",Illusion,,цифров,,,"Любовен роман","·········· Любовни романи и повести",,,първо,Читанка,2018,,,,,,,,in82qh,,2018-12-29T19:45:21+02:00,2021-03-20T06:08:14+02:00
12211,"Френската прислужница",,,"Сабрина Джефрис",Elinor,,цифров,,,"Съвременна проза (XXI век); Любов и романтика","···················· Съвременна проза: разкази и новели",,,първо,Читанка,2020,,"Eli; Book Junkie (от английски)",,,,,,debora,,2020-04-12T16:23:53+03:00,2020-05-02T10:00:22+03:00
5048,Опиянени,,,"Манди Бек",Illusion,,цифров,,,"Любовен роман; Съвременен любовен роман","·········· Любовни романи и повести",,,първо,Читанка,2018,,,,,,,,in82qh,,2018-03-21T21:21:41+02:00,2021-03-20T06:32:18+02:00
10168,"Затворническата планета на варварите",,,"Руби Диксън",Ralna,,цифров,,,"Романтично фентъзи; Еротичен любовен роман; Любовен роман","···················· Фентъзи",,,първо,Читанка,2017,,"galileo414; desi7y; sladcheto",,,,,,Silverkata,,2019-06-09T09:32:27+03:00,2019-09-02T21:14:54+03:00
10171,"Отвличането на леърда",,,"Тери Брисбейн",Ralna,,цифров,,,"Исторически любовен роман; Любовен роман","·········· Любовни романи и повести",,,първо,Читанка,2015,,ganinka,,,,,,Silverkata,,2019-06-09T13:34:18+03:00,2019-08-13T00:41:21+03:00
10179,"Ако те пусна",,,"Кайра Ленън",ganinka,,цифров,,,"Съвременен любовен роман; Любовен роман","·········· Любовни романи и повести",,,първо,Читанка,2016,,denensita,,,,,,Silverkata,,2019-06-09T14:44:42+03:00,2019-12-03T09:39:26+02:00
10184,"Алфа детектив",,,"Зоуи Чант",Сирена,,цифров,,,"Романтично фентъзи; Еротичен любовен роман; Любовен роман","·········· Любовни романи и повести",,,първо,Читанка,2018,,desi7y,,,,,,Silverkata,,2019-06-09T15:44:59+03:00,2019-12-03T09:40:09+02:00
10185,"Писма до Ели",,,"Лорет Ан Уайт",ganinka,,цифров,,,"Съвременен любовен роман; Любовен роман","·········· Любовни романи и повести",,,първо,Читанка,2015,,denensita,,,,,,Silverkata,,2019-06-09T16:04:17+03:00,2019-08-13T00:38:19+03:00
10186,"Пътят към дома",,,"Хелън Кей Даймън",denensita,,цифров,,,"Съвременен любовен роман; Любовен роман","·········· Любовни романи и повести",,,първо,Читанка,2015,,ganinka,,,,,,Silverkata,,2019-06-09T16:17:15+03:00,2019-08-13T00:37:56+03:00
1739,"Историята на твоя живот",,,"Тед Чанг","З. Петков",,цифров,,,"Научна фантастика; Твърда научна фантастика; Философска фантастика","···················· Научна фантастика",,,,Читанка,2017,,,,,,"analda, filthy",,Epsilon,,2017-04-23T13:22:03+03:00,2018-12-15T09:24:19+02:00
10189,"Рицарят на Розамунд",,,"Маргарет Мур",fakirova,,цифров,,,"Исторически любовен роман; Любовен роман","·········· Любовни романи и повести",,,първо,Читанка,2015,,"Ralna; hrUssI",,,,,,Silverkata,,2019-06-09T16:40:13+03:00,2019-11-12T06:55:59+02:00
10191,"Нейният разбойник",,,"Робин Дехарт",Ralna,,цифров,,,"Исторически любовен роман; Любовен роман","·········· Любовни романи и повести",,,първо,Читанка,2015,,"desi7y; ganinka",,,,,,Silverkata,,2019-06-09T16:54:26+03:00,2019-08-13T00:36:28+03:00
8402,"Празнична измама",,,"Дженифър Пробст",Illusion,,цифров,,,"Любовен роман; Съвременен любовен роман","·········· Любовни романи и повести",,,първо,Читанка,2018,,,,,,,,in82qh,,2019-01-02T17:14:50+02:00,2021-03-20T06:37:30+02:00
6623,Вълнения,"Любителска поезия",,"Борис Младенов — Young","Борис Младенов — Young",,"хартия и цифров",,,,"·········· Поезия",978-619-00-0083-9,,първо,Фабер,2014,,,,,,,,zelenkroki,,2018-07-19T00:51:50+03:00,2021-10-09T09:10:14+03:00
20448,"Връщам се за теб",,,"Гийом Мюсо",,,цифров,,,"Съвременен роман (XXI век)","···················· Съвременни романи и повести",,"Моята библиотека",първо,Читанка,2024,,,,,,,,Silverkata,,2024-05-12T08:03:47+03:00,2024-05-12T08:08:18+03:00
14050,Стъпки,,,"Йежи Кошински","Красимир Желязков",,цифров,,,,"···················· Съвременни романи и повести",,,"първо (не е указано)",Читанка,2020,,,,,,,,analda,,2020-11-12T14:12:07+02:00,2021-03-20T06:44:20+02:00
14051,"Обявяването на лот 49",,,"Томас Пинчън","Красимир Желязков",,цифров,,,"Интелектуален (експериментален) роман; Постмодерен роман","···················· Съвременни романи и повести",,,"първо (не е указано)",Читанка,2020,,,,,,,,analda,,2020-11-12T14:28:13+02:00,2021-03-20T06:30:43+02:00
11496,"Коледен обет",,,"Алекса Райли",Сирена,,цифров,,,"Съвременен любовен роман","·········· Любовни романи и повести",,,,Читанка,,,desi7y,,,,,,Еми,,2019-12-20T08:59:03+02:00,2019-12-28T13:35:02+02:00
19689,Космобиолози,,,"Олга Громико; Андрей Уланов","Ваня Иванова",,цифров,,,"Космическа фантастика; Хумористична и пародийна фантастика","···················· Научна фантастика",,"Моята библиотека",първо,Читанка,2023,,,,,,,,Silverkata,,2023-11-28T21:05:43+02:00,2024-03-31T21:10:51+03:00
18943,"Ученик на медиум",,,"Алекс Кош","Пламен Панайотов",,цифров,,,"Градско фентъзи; Алтернативна история; Фентъзи","···················· Фентъзи",,,първо,Читанка,2023,,,,,,,,cattiva2511,,2023-06-27T09:32:35+03:00,2024-03-25T15:24:55+02:00
10150,"Ангелски танц",,,"Налини Синг",Сирена,,цифров,,,"Романтично фентъзи; Любовен роман","···················· Фентъзи",,,,Читанка,2018,,"galileo414; desi7y",,,,,,Silverkata,,2019-06-08T09:29:53+03:00,2019-11-12T06:52:42+02:00
10007,"Девицата булка",,,"Алекса Райли",Ralna,,цифров,,,"Съвременен любовен роман","·········· Любовни романи и повести",,,първо,Читанка,2017,,"galileo414; desi7y; sladcheto",,,,,,Silverkata,,2019-06-03T13:51:22+03:00,2019-10-27T20:48:36+02:00
10124,"Коледен подарък",,,"Лий-Анн Уолъс",Ralna,,цифров,,,"Еротичен любовен роман; Романтично фентъзи; Любовен роман","···················· Фентъзи",,,първо,Читанка,2016,,ganinka,,,,,,Silverkata,,2019-06-08T00:21:28+03:00,2019-12-02T09:18:57+02:00
10183,"Един сезон в Лондон",,,"Кристин Уайдън",Ralna,,цифров,,,"Исторически любовен роман; Любовен роман","·········· Любовни романи и повести",,,първо,Читанка,2016,,Еми,,,,,,Silverkata,,2019-06-09T15:32:30+03:00,2019-12-03T09:39:47+02:00
10187,"Един секси планинец",,,"Сюзън Еноч",Ralna,,цифров,,,"Исторически любовен роман; Любовен роман","·········· Любовни романи и повести",,,първо,Читанка,2015,,ganinka,,,,,,Silverkata,,2019-06-09T16:26:15+03:00,2019-08-13T00:37:32+03:00
11778,Нескопоското,,,"Сергей Лукяненко","Клара Стоименова",,цифров,,,"Героическо фентъзи (Меч и магия); Роман за съзряването; Фентъзи; Хумористично и пародийно фентъзи","···················· Фентъзи",,"Моята библиотека",първо,Читанка,2011,,,,,,analda,"Евгения Стерлигова",NomaD,,2020-02-03T21:55:06+02:00,2020-08-23T10:50:06+03:00
12291,"Ад на колела",,,"Джули Ан Уокър",Illusion,,цифров,,,"Съвременен любовен роман; Любовен роман","·········· Любовни романи и повести",,,първо,Читанка,2015,,,,,,,,Silverkata,,2020-05-01T09:49:20+03:00,2020-05-06T09:53:03+03:00
6406,Фюри,,,"Лорън Донър",Illusion,,цифров,,,"Любовен роман; Романтично фентъзи; Фентъзи","·········· Любовни романи и повести",,,първо,Читанка,2013,,,,,,,,in82qh,,2018-07-02T12:46:50+03:00,2021-03-20T06:42:54+02:00
14086,Костюмарят,,,"Бранди Толър",readlife.eu,,цифров,,,"Любовен роман; Съвременен любовен роман","·········· Любовни романи и повести",,,"първо (не е указано)",Читанка,2020,,"Татяна Петкова",,,,,,Silverkata,,2020-11-17T07:16:34+02:00,2020-12-05T13:07:35+02:00
10763,"Магьоснически огън",,,"Аня Баст","Zaharka; Vania; kaley; mishle55; Renesita",,цифров,,,"Романтично фентъзи; Еротичен любовен роман; Любовен роман","···················· Фентъзи",,,първо,Читанка,2019,,"Zaharka; escapingthesun; Renesita",,,,,,Silverkata,,2019-08-19T18:43:06+03:00,2020-02-08T17:25:22+02:00
10006,"Неговата принцеса",,,"Алекса Райли",Ralna,,цифров,,,"Кратък любовен роман","·········· Любовни романи и повести",,,първо,Читанка,2017,,"galileo414; desi7y; sladcheto",,,,,,Silverkata,,2019-06-03T13:40:04+03:00,2019-10-27T20:47:56+02:00
10008,"Да бележиш девица",,,"Алекса Райли",Ralna,,цифров,,,"Съвременен любовен роман","·········· Любовни романи и повести",,,първо,Читанка,2016,,ganinka,,,,,,Silverkata,,2019-06-03T14:08:32+03:00,2019-10-27T20:49:15+02:00
12315,"Как да отвлечеш шотландски лорд",,,"Карън Хоукинс",Fantastique,,цифров,,,"Любовен роман; Исторически любовен роман","·········· Любовни романи и повести",,,първо,Читанка,2012,,,,,,,,Silverkata,,2020-05-06T10:02:52+03:00,2020-05-06T10:23:58+03:00
10013,"Въздухът, който той диша",,,"Британи Чери",Lux,,цифров,,,"Съвременен любовен роман; Любовен роман","·········· Любовни романи и повести",,,първо,Читанка,2016,,"desi7y; ganinka",,,,,,Silverkata,,2019-06-03T14:38:12+03:00,2019-12-03T09:36:03+02:00
7968,"Дълго пътуване",,,"Катрин Фокс",Illusion,,цифров,,,,"·········· Любовни романи и повести",,,първо,Читанка,2018,,,,,,,,in82qh,,2018-11-24T14:36:12+02:00,2021-03-20T06:17:50+02:00
3874,"Огненият факултет",,,"Алекс Кош","Клара Стоименова",,цифров,,,"Вампири и върколаци; Градско фентъзи; Фентъзи","···················· Фентъзи",,"Моята библиотека",първо,Читанка,2010,,,,,,,,in82qh,,2017-12-03T17:01:45+02:00,2022-10-05T13:20:36+03:00
10018,"Мрачна красота",,,"Джилиан Итън",denensita,,цифров,,,"Исторически любовен роман","·········· Любовни романи и повести",,,първо,Читанка,2015,,ganinka,,,,,,Silverkata,,2019-06-03T16:18:58+03:00,2019-06-03T16:28:39+03:00
10022,"Жената на воина",,,"Джоана Линдзи",Ralna,,цифров,,,"Исторически любовен роман","·········· Любовни романи и повести",,,първо,Читанка,2012,,,,,,,,Silverkata,,2019-06-03T16:53:30+03:00,2019-06-03T17:01:45+03:00
12838,"Душевен огън",,,"Ейприл Легаси","Carnival of words",,цифров,,,"Романтично фентъзи; Фентъзи","···················· Фентъзи",,,първо,Читанка,2020,,,,,,,,Silverkata,,2020-06-15T06:47:44+03:00,2020-08-03T18:32:55+03:00
10027,"Дамата на Лайън",,,"Джули Гарууд",Ralna,,цифров,,,"Исторически любовен роман; Любовен роман","·········· Любовни романи и повести",,,първо,Читанка,2015,,"galileo414; ganinka",,,,,,Silverkata,,2019-06-03T17:34:40+03:00,2020-05-01T10:00:04+03:00
3890,"Буря от ада",,,"Джим Бъчър","З. Петков",,цифров,,,"Вампири и върколаци; Градско фентъзи; Криминална литература; Фентъзи","···················· Фентъзи",,"Моята библиотека",първо,Читанка,2011,,,,,,,,in82qh,,2017-12-04T11:30:44+02:00,2021-03-20T06:11:53+02:00
12344,"Вампирски целувки",,,"Елън Шрайбер","MimzZz; reallovr; Prophecy_girL; ki6i; zara",,цифров,,,"Романтично фентъзи; Фентъзи","···················· Фентъзи",,,първо,Читанка,2009,,,,,,,,Silverkata,,2020-05-11T09:44:12+03:00,2020-07-17T22:50:32+03:00
5951,"Порочен милиардер",,,"Мегън Марч",Ralna,,цифров,,,"Любовен роман; Съвременен любовен роман; Еротичен любовен роман","·········· Любовни романи и повести",,,първо,Читанка,2016,,"galileo414; desi7y; ganinka",,,,,,in82qh,,2018-05-29T15:41:09+03:00,2019-08-13T00:22:21+03:00
14399,"Вещицата Илзе",,,"Тери Брукс","Светла Бакалова",,цифров,,,"Героическо фентъзи (Меч и магия); Историческо фентъзи","···················· Фентъзи",,,първо,Читанка,2021,,,,,,,,cattiva2511,,2021-01-05T14:44:21+02:00,2021-01-19T12:36:21+02:00
10049,"Херцогът и девицата",,,"Доминик Ийстуик",Ralna,,цифров,,,"Исторически любовен роман","·········· Любовни романи и повести",,,първо,Читанка,2015,,"desi7y; ganinka",,,,,,Silverkata,,2019-06-04T15:50:59+03:00,2019-06-04T16:07:44+03:00
8797,Здрач,,,"Стефани Майър","Моника Колчевска",,цифров,,,,"·········· Любовни романи и повести",,,,Читанка,2008,,,,,,,,analda,,2019-02-07T12:06:09+02:00,2019-02-16T14:08:39+02:00
10121,"Земно привличане",,"Част първа","Л. Дж. Кастило",denensita,,цифров,,,"Съвременен любовен роман; Любовен роман","·········· Любовни романи и повести",,,първо,Читанка,2018,,"desi7y; sladcheto",,,,,,Silverkata,,2019-06-08T00:11:13+03:00,2019-12-03T09:39:05+02:00
10122,"Перфектната половинка",,,"Лий-Анн Уолъс",Ralna,,цифров,,,"Еротичен любовен роман; Романтично фентъзи; Любовен роман","···················· Фентъзи",,,първо,Читанка,2016,,"galileo414; desi7y; ganinka",,,,,,Silverkata,,2019-06-08T00:16:57+03:00,2019-12-02T09:19:32+02:00
10125,"Седем Синове",,,"Лили Сейнт Джърмейн",denensita,,цифров,,,"Любовно-криминален роман; Еротичен любовен роман","·········· Криминална проза",,,първо,Читанка,2015,,"Ralna; ganinka",,,,,,Silverkata,,2019-06-08T00:26:14+03:00,2019-06-08T08:00:58+03:00
10128,"Да изкушиш звяра",,,"Лора Лей",Fantastique,,цифров,,,"Романтично фентъзи; Еротичен любовен роман","···················· Фентъзи",,,първо,Читанка,2011,,,,,,,,Silverkata,,2019-06-08T00:51:00+03:00,2019-06-08T01:12:53+03:00
1939,"Най-непохватната вещица",,,"Джил Мърфи",Illusion,,цифров,,,"Детска литература; Детско и младежко фентъзи","···················· Фентъзи",,,,Читанка,2017,,,,,,,,in82qh,,2017-05-22T13:32:19+03:00,2019-02-19T11:22:22+02:00
1942,"Обвързани с кръв",,,"Синтия Идън",Illusion,,цифров,,,"Вампири и върколаци; Градско фентъзи; Любовен роман","·········· Любовни романи и повести",,,,Читанка,2017,,,,,,,,in82qh,,2017-05-22T14:06:01+03:00,2019-02-19T11:22:57+02:00
10140,"Подаръкът на Шейха",,,"Маргарит Кей",ganinka,,цифров,,,"Исторически любовен роман; Любовен роман","·········· Любовни романи и повести",,,първо,Читанка,2015,,denensita,,,,,,Silverkata,,2019-06-08T02:10:19+03:00,2019-06-08T02:15:08+03:00
7837,"Прокрадващ се в сенките",,,"Алексей Пехов","Пламен Панайотов",,цифров,,,"Героическо фентъзи (меч и магия); Епическо време (епоха на герои); Път; пътуване; Фентъзи","···················· Фентъзи",,"Моята библиотека",,Читанка,,,,,,,,,analda,,2018-11-13T20:52:00+02:00,2019-02-16T14:12:51+02:00
10141,"Пленена от принца на вълците",,,"Маргарит Кей",ganinka,,цифров,,,"Исторически любовен роман; Любовен роман; Романтично фентъзи","·········· Любовни романи и повести",,,първо,Читанка,2016,,Ralna,,,,,,Silverkata,,2019-06-08T02:15:56+03:00,2019-11-12T06:51:56+02:00
10143,"Порочно момиче",,,"Мегън Марч",Ralna,,цифров,,,"Съвременен любовен роман; Еротичен любовен роман","·········· Любовни романи и повести",,,първо,Читанка,2016,,"galileo414; desi7y; ganinka",,,,,,Silverkata,,2019-06-08T08:24:41+03:00,2019-08-28T15:15:54+03:00
10145,"Истински добър мъж",,,"Мегън Марч",Ralna,,цифров,,,"Съвременен любовен роман; Еротичен любовен роман","·········· Любовни романи и повести",,,първо,Читанка,2017,,"galileo414; desi7y; sladcheto",,,,,,Silverkata,,2019-06-08T08:47:17+03:00,2019-08-28T15:17:05+03:00
10147,"Истински порочно",,,"Мегън Марч",Ralna,,цифров,,,"Съвременен любовен роман; Еротичен любовен роман; Любовен роман","·········· Любовни романи и повести",,,първо,Читанка,2018,,"galileo414; desi7y; sladcheto",,,,,,Silverkata,,2019-06-08T09:11:32+03:00,2019-08-28T15:18:16+03:00
6055,"Игра на маски",,,"Алекс Кош","Пламен Панайотов",,цифров,,,"Боен екшън; Приключения в съвременния свят; Свръхестествено; Градско фентъзи; Научно фентъзи и технофентъзи; Роман за съзряването; Фентъзи","···················· Фентъзи",,"Моята библиотека",първо,Читанка,2018,,,,,,"Олег Бабкин",,NomaD,,2018-06-05T14:33:10+03:00,2022-10-05T13:13:08+03:00
10151,Обречен,,,"Ребека Занети",Ralna,,цифров,,,"Романтично фентъзи","···················· Фентъзи",,,първо,Читанка,2016,,"galileo414; desi7y; ganinka",,,,,,Silverkata,,2019-06-08T09:36:34+03:00,2019-08-13T00:29:16+03:00
6058,"Лабиринт от отражения",,,"Сергей Лукяненко","Светлана Нанчева",,цифров,,,"Киберпънк; Научна фантастика; Приключенска фантастика","···················· Научна фантастика",,"Моята библиотека","Първо издание",Читанка,2018,,"Антонио Гинев",,,,,,NomaD,,2018-06-05T21:33:53+03:00,2018-11-13T20:40:07+02:00
6060,"Войни започват неудачниците",,,"Вадим Панов",abrams,,цифров,,,"Градско фентъзи; Пиключениея в съвременния свят; Фентъзи","···················· Фентъзи",,"Моята библиотека",Първо,Читанка,2018,,,,,,,,NomaD,,2018-06-05T22:33:21+03:00,2018-10-15T13:20:06+03:00
6066,"Херцогът и аз",,,"Джулия Куин","Dream Team",,цифров,,,"Любовен роман","·········· Любовни романи и повести",,,,Читанка,2016,,,,,,,,vesi_libra,,2018-06-06T21:15:07+03:00,2019-02-19T11:34:25+02:00
10162,"Варварите от ледената планета",,,"Руби Диксън",Ralna,,цифров,,,"Романтично фентъзи; Еротичен любовен роман; Любовен роман","···················· Фентъзи",,,първо,Читанка,2019,,"desi7y; galileo414; sladcheto",,,,,,Silverkata,,2019-06-09T08:39:00+03:00,2019-09-02T21:14:32+03:00
10163,"Огънят в кръвта му",,,"Руби Диксън",Сирена,,цифров,,,"Романтично фентъзи; Еротичен любовен роман; Любовен роман","···················· Фентъзи",,,първо,Читанка,2018,,"galileo414; desi7y; sladcheto",,,,,,Silverkata,,2019-06-09T08:49:51+03:00,2020-09-22T20:18:58+03:00
6069,"Как да си хванеш наследница",,,"Джулия Куин",Illusion,,цифров,,,"Любовен роман","·········· Любовни романи и повести",,,,Читанка,2013,,,,,,,,vesi_libra,,2018-06-06T21:50:12+03:00,2024-03-30T23:27:23+02:00
10165,"Пленница на звездния пират",,,"Руби Диксън",Ralna,,цифров,,,"Романтично фентъзи; Еротичен любовен роман; Любовен роман","···················· Фентъзи",,,първо,Читанка,2018,,"galileo414; desi7y; sladcheto",,,,,,Silverkata,,2019-06-09T09:01:19+03:00,2019-12-04T20:27:33+02:00
10169,НЕцивилизован,,,"Сойър Бенет",elfite_bgworld,,цифров,,,"Съвременен любовен роман; Еротичен любовен роман; Любовен роман","·········· Любовни романи и повести",,,първо,Читанка,2016,,"Ralna; ganinka",,,,,,Silverkata,,2019-06-09T12:56:58+03:00,2019-09-02T21:17:13+03:00