id,title,subtitle,volumeTitle,author,translator,compiler,media,pageCount,binding,genre,category,isbn,sequence,edition,publisher,publishingYear,chiefEditor,editor,publisherEditor,artistEditor,technicalEditor,artist,illustrator,createdBy,completedBy,createdAt,updatedAt
11914,Амфитеатър,"Антични и други анекдоти",,,,"Рашко Стойков",хартия,128,мека,"Анекдот, виц; Хумористична проза","·········· Хумор и сатира",,"Библиотека „Панорама“",първо,"ДИ „Народна култура“",1978,,"Марко Ганчев",,"Ясен Васев","Олга Стоянова","Симеон Венов",,debora,,2020-03-01T20:26:16+02:00,2020-03-01T23:48:30+02:00
9004,"Зебрата или театърът на любовта",,,"Александър Жарден","Нина Венова",,хартия,144,,"Съвременен роман (XX век)","···················· Съвременни романи и повести",954-474-001-5,,първо,"ИК „Кибеа“",1991,,"Андрей Манолов",,,"Олга Алашка","Николай Пекарев",,vesi_libra,,2019-02-26T17:18:14+02:00,2019-02-26T17:27:17+02:00
20525,"Съветски театър",,,"Максим Горки; Константин Треньов; Всеволод Иванов; Борис Лавреньов; Всеволод Вишневски; Александър Корнейчук; Николай Погодин","Катя Койчева; Григор Ленков; Людмила Алтънова; Банчо Банов; Христо Берберов; Андрей Германов","Филип Филипов",хартия,536,"твърда с обложка",,"···················· Театър",,"Библиотека „Световна класика“",първо,"ДИ „Народна култура“",1974,,,"Лилия Илиева","Васил Йончев","Радка Пеловска",,,Еми,,2024-05-21T13:02:54+03:00,2024-05-21T13:22:49+03:00
10001,Театър,,,"Съмърсет Моам","Мария Донева",,хартия,,мека,,"···················· Съвременни романи и повести",954-8171-06-6,,"(не е указано)","ИК „Силви — Арт“",1994,,"Силви Гърчева; Илияна Велева",,,,,,Еми,,2019-06-03T12:31:16+03:00,2019-06-03T12:41:46+03:00
5917,Театър,,,"Съмърсет Моъм","Мария Донева",,хартия,248,"твърда с обложка","Съвременен роман (XX век)","···················· Съвременни романи и повести",,"Библиотека Избрани романи",първо,"ДИ „Народна култура“",1984,,"Анна Сталева",,"Николай Пекарев","Красимир Градев","Кръстьо Кръстев",,Karel,,2018-05-27T00:44:51+03:00,2018-07-14T19:29:39+03:00
19309,"Театър на френския класицизъм","Нови преводи",,,"Паисий Христов","Паисий Христов",цифров,,,"Драма; Комедия","·········· Драматургия",,,"първо и второ",Читанка,2023,,"Весела Генова",,,,,,Silverkata,,2023-09-11T09:07:51+03:00,2023-09-25T11:01:30+03:00
4040,"Убийство в театъра",,,"Фабиан Ленк","Ирена Патулова",,хартия,152,мека,"Детска криминална литература","···················· Романи и повести за деца",978-954-625-648-5,,"първо (не е указано)","Издателство „Фют“",2010,,"Илияна Владимирова",,,,,"Алмут Кунерт",Еми,,2017-12-17T12:24:16+02:00,2021-09-08T13:35:24+03:00
12712,"Френски театър на класицизма",,,,"Пенчо Симов",,хартия,400,"твърда с обложка","Трагедии; Театър; Драматургия","···················· Театър",,"Библиотека „Световна класика“",първо,"ДИ „Народна култура“",1974,,"Марко Ганчев",,"Васил Йончев","Радка Пеловска","Иван Кьосев",,Еми,vesi_libra,2020-06-04T19:07:58+03:00,2020-07-17T10:45:05+03:00
